{"text_format":"1","workbook":"xlsx","n_sheets":7,"sheets":["Instructions","TD-2R-DETAIL","TD-2R-EC","LEAVE RATES","SUMMARY","DPI Use - LEA Info ","Module1"],"not_rendered":{"charts":0,"images":0,"macros":1,"external_links":1,"defined_names":7,"comments":0,"pivot_tables":0},"unopened":[{"sheet":"Module1","index":6,"reason":"part_missing"}],"bounds":{"document_bytes":16777216,"sheet_cells":100000,"rows_first":2000,"rows_last":500,"rows_between":2000,"halvings":0,"cell_chars":16384,"cell_head_chars":4096},"cells_cut":0,"cells_raw":0,"read":"whole","date_system":"1900"}

{"sheet":"Instructions","index":0,"n_rows":83,"n_cols":2,"rows_kept":83,"cut":false,"hidden":false,"merged":[]}
["INSTRUCTIONS FOR FORM TD-2R"]
["DUE October 16, 2023"]
[]
["Enter the Unit Name and Number using drop down arrow on the Summary Tab"]
[]
["Col. A   Leave Rate  - Enter Leave Rate (Determine years of state service for eligible driver and enter leave rate from \"Leave Rate Chart.\")"]
[]
["Col. 1   Bus Number - Enter the number of the bus assigned to the route."]
[]
["Col. 2    School Number - Enter the number of the school at which the bus is assigned."]
[]
["Col. 3    Driver Name - Enter name of the driver assigned to the bus route."]
[]
["Col. 4    Employment Status - Enter one of the following codes that applies to the driver:"]
[]
[null,"FP - Full Time Permanent - Employee who drives a school bus 30 or more hours per"]
[null,"week and receives benefits normally associated with permanent employment"]
[null,"(retirement, social security, hospitalization, and leave time)."]
[]
[null,"FS - Full Time Permanent (split-funded) - Employee who drives a school bus and works"]
[null,"in another capacity for the school system, whereby all combined work equals 30 or more"]
[null,"hours per week and receives benefits for the driving duties (retirement, social security,"]
[null,"hospitalization, and leave time)."]
[]
[null,"FO - Full Time Other - Employee who drives a school bus or works a split-funded job 30"]
[null,"or more hours per week but does not contribute to retirement for the driving duties. The"]
[null,"employee may or may not receive leave benefits."]
[]
[null,"PP - Part Time Permanent - Employee who drives a school bus 20 but less than 30"]
[null,"hours per week and receives leave benefits."]
[]
[null,"PS - Part Time Permanent (split-funded) - Employee who drives a school bus and works"]
[null,"in another capacity for the school system whereby all combined work equals 20 but less"]
[null,"than 30 hours per week and receives leave benefits for the driving duties."]
[]
[null,"PO - Part Time Other - Employee who drives a school bus or works a split-funded job"]
[null,"20 hours but less than 30 hours per week and does not receive leave benefits for bus"]
[null,"driving."]
[]
[null,"PT - Part Time Temporary - Employee who drives a school bus less than 20 hours per"]
{"$rows_left_out":44}
{"sheet":"TD-2R-DETAIL","index":1,"n_rows":2092,"n_cols":18,"rows_kept":2092,"cut":false,"hidden":false,"merged":[[0,0,0,14],[1,0,1,14],[2,0,2,14],[3,0,3,14],[4,0,4,14]]}
["PUBLIC SCHOOLS OF NORTH CAROLINA"]
["STATE BOARD OF EDUCATION - DEPARTMENT OF PUBLIC INSTRUCTION"]
["OFFICE OF DISTRICT OPERATIONS/TRANSPORTATION SERVICES"]
[" DRIVER SALARY AND ROUTE TIMES REPORT"]
["2023-2024 - REGULAR BUS DRIVER ROUTE DETAILS"]
[]
["LEAVE",1,2,3,4,5,6,7,8,9,10,11,12,13,14]
["RATE","BUS","SCH.","DRIVER","EMP.","RT. MI.","ROUTE","MIN/","HOURLY","DAILY","Holiday","Ann. Lv.","Misc. Lv.","Totl Lv","LEAVE"]
["(not printed)","NO.","NO.","NAME","ST","DAILY","HOURS","MILE","RATE","RATE","Hours","Hours","Hours","Hours","COMPENSATION","Person ID","Unique Check","Subtract"]
[null,{"$f":"SUM(IF(FREQUENCY(IF(LEN(B11:B2087)>0,MATCH(B11:B2087,B11:B2087,0),\"\"),IF(LEN(B11:B2087)>0,MATCH(B11:B2087,B11:B2087,0),\"\"))>0,1))","v":0},"<-------","# Unique Buses","xxxxxxxx",{"$f":"SUM(F11:F2077)","v":0},{"$f":"SUM(G11:G2077)","v":0},{"$f":"IF(ISERR(AVERAGE(H11:H2077)),\"\",(AVERAGE(H11:H2076)))","v":""},{"$f":"IF(ISERR(AVERAGE(I11:I2077)),\"\",(AVERAGE(I11:I2076)))","v":""},{"$f":"SUM(J11:J2077)","v":0},0,0,0,0,0]
[null,null,null,null,null,null,null,{"$f":"IF(ISBLANK(F11),\"\",SUM(G11*60)/F11)","v":""},null,{"$f":"IF(NOT(ISBLANK(G11)),G11*I11,\"\")","v":""},{"$f":"IF(NOT(ISBLANK(G11)),IF(A11>0,10*G11,\"\"),\"\")","v":""},{"$f":"IF(NOT(ISBLANK(G11)),IF(A11> 0,10*SUM(A11*G11),\"\"),\"\")","v":""},{"$f":"IF(NOT(ISBLANK(H11)),IF(A11> 0,G11/2*10,\"\"),\"\")","v":""},{"$f":"IF(NOT(ISBLANK(G11)),SUM(K11:M11),\"\")","v":""},{"$f":"IF(NOT(ISBLANK(I11)),I11*N11,\"\")","v":""},{"$f":"A11&D11&E11","v":""},{"$f":"IF(P11=\"\",\"\",COUNTIF(P12:$P$2087,P11)+COUNTIF('TD-2R-EC'!$P$11:$P$612,P11))","v":""},{"$f":"IF(Q11>0,RIGHT(P11,2),\"\")","v":""}]
[null,null,null,null,null,null,null,"",null,"","","","","","","",{"$f":"IF(P12=\"\",\"\",COUNTIF(P13:$P$2087,P12)+COUNTIF('TD-2R-EC'!$P$11:$P$612,P12))","v":""},{"$f":"IF(Q12>0,RIGHT(P12,2),\"\")","v":""}]
[null,null,null,null,null,null,null,"",null,"","","","","","","",{"$f":"IF(P13=\"\",\"\",COUNTIF(P14:$P$2087,P13)+COUNTIF('TD-2R-EC'!$P$11:$P$612,P13))","v":""},""]
[null,null,null,null,null,null,null,"",null,"","","","","","","",{"$f":"IF(P14=\"\",\"\",COUNTIF(P15:$P$2087,P14)+COUNTIF('TD-2R-EC'!$P$11:$P$612,P14))","v":""},""]
[null,null,null,null,null,null,null,"",null,"","","","","","","",{"$f":"IF(P15=\"\",\"\",COUNTIF(P16:$P$2087,P15)+COUNTIF('TD-2R-EC'!$P$11:$P$612,P15))","v":""},""]
[null,null,null,null,null,null,null,"",null,"","","","","","","",{"$f":"IF(P16=\"\",\"\",COUNTIF(P17:$P$2087,P16)+COUNTIF('TD-2R-EC'!$P$11:$P$612,P16))","v":""},""]
[null,null,null,null,null,null,null,"",null,"","","","","","","",{"$f":"IF(P17=\"\",\"\",COUNTIF(P18:$P$2087,P17)+COUNTIF('TD-2R-EC'!$P$11:$P$612,P17))","v":""},""]
[null,null,null,null,null,null,null,"",null,"","","","","","","",{"$f":"IF(P18=\"\",\"\",COUNTIF(P19:$P$2087,P18)+COUNTIF('TD-2R-EC'!$P$11:$P$612,P18))","v":""},""]
[null,null,null,null,null,null,null,"",null,"","","","","","","",{"$f":"IF(P19=\"\",\"\",COUNTIF(P20:$P$2087,P19)+COUNTIF('TD-2R-EC'!$P$11:$P$612,P19))","v":""},""]
[null,null,null,null,null,null,null,"",null,"","","","","","","",{"$f":"IF(P20=\"\",\"\",COUNTIF(P21:$P$2087,P20)+COUNTIF('TD-2R-EC'!$P$11:$P$612,P20))","v":""},""]
[null,null,null,null,null,null,null,"",null,"","","","","","","",{"$f":"IF(P21=\"\",\"\",COUNTIF(P22:$P$2087,P21)+COUNTIF('TD-2R-EC'!$P$11:$P$612,P21))","v":""},""]
[null,null,null,null,null,null,null,"",null,"","","","","","","",{"$f":"IF(P22=\"\",\"\",COUNTIF(P23:$P$2087,P22)+COUNTIF('TD-2R-EC'!$P$11:$P$612,P22))","v":""},""]
[null,null,null,null,null,null,null,"",null,"","","","","","","",{"$f":"IF(P23=\"\",\"\",COUNTIF(P24:$P$2087,P23)+COUNTIF('TD-2R-EC'!$P$11:$P$612,P23))","v":""},""]
[null,null,null,null,null,null,null,"",null,"","","","","","","",{"$f":"IF(P24=\"\",\"\",COUNTIF(P25:$P$2087,P24)+COUNTIF('TD-2R-EC'!$P$11:$P$612,P24))","v":""},""]
[null,null,null,null,null,null,null,"",null,"","","","","","","",{"$f":"IF(P25=\"\",\"\",COUNTIF(P26:$P$2087,P25)+COUNTIF('TD-2R-EC'!$P$11:$P$612,P25))","v":""},""]
[null,null,null,null,null,null,null,"",null,"","","","","","","",{"$f":"IF(P26=\"\",\"\",COUNTIF(P27:$P$2087,P26)+COUNTIF('TD-2R-EC'!$P$11:$P$612,P26))","v":""},""]
[null,null,null,null,null,null,null,"",null,"","","","","","","",{"$f":"IF(P27=\"\",\"\",COUNTIF(P28:$P$2087,P27)+COUNTIF('TD-2R-EC'!$P$11:$P$612,P27))","v":""},""]
[null,null,null,null,null,null,null,"",null,"","","","","","","",{"$f":"IF(P28=\"\",\"\",COUNTIF(P29:$P$2087,P28)+COUNTIF('TD-2R-EC'!$P$11:$P$612,P28))","v":""},""]
[null,null,null,null,null,null,null,"",null,"","","","","","","",{"$f":"IF(P29=\"\",\"\",COUNTIF(P30:$P$2087,P29)+COUNTIF('TD-2R-EC'!$P$11:$P$612,P29))","v":""},""]
[null,null,null,null,null,null,null,"",null,"","","","","","","",{"$f":"IF(P30=\"\",\"\",COUNTIF(P31:$P$2087,P30)+COUNTIF('TD-2R-EC'!$P$11:$P$612,P30))","v":""},""]
[null,null,null,null,null,null,null,"",null,"","","","","","","",{"$f":"IF(P31=\"\",\"\",COUNTIF(P32:$P$2087,P31)+COUNTIF('TD-2R-EC'!$P$11:$P$612,P31))","v":""},""]
[null,null,null,null,null,null,null,"",null,"","","","","","","",{"$f":"IF(P32=\"\",\"\",COUNTIF(P33:$P$2087,P32)+COUNTIF('TD-2R-EC'!$P$11:$P$612,P32))","v":""},""]
[null,null,null,null,null,null,null,"",null,"","","","","","","",{"$f":"IF(P33=\"\",\"\",COUNTIF(P34:$P$2087,P33)+COUNTIF('TD-2R-EC'!$P$11:$P$612,P33))","v":""},""]
[null,null,null,null,null,null,null,"",null,"","","","","","","",{"$f":"IF(P34=\"\",\"\",COUNTIF(P35:$P$2087,P34)+COUNTIF('TD-2R-EC'!$P$11:$P$612,P34))","v":""},""]
[null,null,null,null,null,null,null,"",null,"","","","","","","",{"$f":"IF(P35=\"\",\"\",COUNTIF(P36:$P$2087,P35)+COUNTIF('TD-2R-EC'!$P$11:$P$612,P35))","v":""},""]
[null,null,null,null,null,null,null,"",null,"","","","","","","",{"$f":"IF(P36=\"\",\"\",COUNTIF(P37:$P$2087,P36)+COUNTIF('TD-2R-EC'!$P$11:$P$612,P36))","v":""},""]
[null,null,null,null,null,null,null,"",null,"","","","","","","",{"$f":"IF(P37=\"\",\"\",COUNTIF(P38:$P$2087,P37)+COUNTIF('TD-2R-EC'!$P$11:$P$612,P37))","v":""},""]
[null,null,null,null,null,null,null,"",null,"","","","","","","",{"$f":"IF(P38=\"\",\"\",COUNTIF(P39:$P$2087,P38)+COUNTIF('TD-2R-EC'!$P$11:$P$612,P38))","v":""},""]
[null,null,null,null,null,null,null,"",null,"","","","","","","",{"$f":"IF(P39=\"\",\"\",COUNTIF(P40:$P$2087,P39)+COUNTIF('TD-2R-EC'!$P$11:$P$612,P39))","v":""},""]
[null,null,null,null,null,null,null,"",null,"","","","","","","",{"$f":"IF(P40=\"\",\"\",COUNTIF(P41:$P$2087,P40)+COUNTIF('TD-2R-EC'!$P$11:$P$612,P40))","v":""},""]
{"$rows_left_out":2053}
{"sheet":"TD-2R-EC","index":2,"n_rows":633,"n_cols":18,"rows_kept":633,"cut":false,"hidden":false,"merged":[[0,0,0,14],[1,0,1,14],[2,0,2,14],[3,0,3,14],[4,0,4,14]]}
["PUBLIC SCHOOLS OF NORTH CAROLINA"]
["STATE BOARD OF EDUCATION - DEPARTMENT OF PUBLIC INSTRUCTION"]
["OFFICE OF DISTRICT OPERATIONS/TRANSPORTATION SERVICES"]
[" DRIVER SALARY AND ROUTE TIMES REPORT"]
["2023-2024 - EXCEPTIONAL CHILDREN (EC) BUS DRIVER ROUTE DETAILS"]
[]
["LEAVE",1,2,3,4,5,6,7,8,9,10,11,12,13,14]
["RATE","BUS","SCH.","DRIVER","EMP.","RT. MI.","ROUTE","MIN/","HOURLY","DAILY","Holiday","Ann. Lv.","Misc. Lv.","Totl Lv","LEAVE"]
["(not printed)","NO.","NO.","NAME","ST.","DAILY","HOURS","MILE","RATE","RATE","Hours","Hours","Hours","Hours","COMPENSATION","Person ID","Unique Check","Subtract"]
[null,{"$f":"SUM(IF(FREQUENCY(IF(LEN(B11:B612)>0,MATCH(B11:B612,B11:B612,0),\"\"),IF(LEN(B11:B612)>0,MATCH(B11:B612,B11:B612,0),\"\"))>0,1))","v":0},"<-------","# Unique Buses","xxxxxxxx",{"$f":"SUM(F11:F603)","v":0},{"$f":"SUM(G11:G603)","v":0},{"$f":"IF(ISERR(AVERAGE(H11:H603)),\"\",(AVERAGE(H11:H602)))","v":""},{"$f":"IF(ISERR(AVERAGE(I11:I603)),\"\",(AVERAGE(I11:I602)))","v":""},{"$f":"SUM(J11:J603)","v":0},0,0,0,0,0]
[null,null,null,null,null,null,null,{"$f":"IF(ISBLANK(F11),\"\",SUM(G11*60)/F11)","v":""},null,{"$f":"IF(NOT(ISBLANK(G11)),G11*I11,\"\")","v":""},{"$f":"IF(NOT(ISBLANK(G11)),IF(A11>0,10*G11,\"\"),\"\")","v":""},{"$f":"IF(NOT(ISBLANK(G11)),IF(A11> 0,10*SUM(A11*G11),\"\"),\"\")","v":""},{"$f":"IF(NOT(ISBLANK(H11)),IF(A11> 0,G11/2*10,\"\"),\"\")","v":""},{"$f":"IF(NOT(ISBLANK(G11)),SUM(K11:M11),\"\")","v":""},{"$f":"IF(NOT(ISBLANK(I11)),I11*N11,\"\")","v":""},{"$f":"A11&D11&E11","v":""},{"$f":"IF(P11=\"\",\"\",COUNTIF(P12:$P$2084,P11))","v":""},{"$f":"IF(Q11>0,RIGHT(P11,2),\"\")","v":""}]
[null,null,null,null,null,null,null,{"$f":"IF(ISBLANK(F12),\"\",SUM(G12*60)/F12)","v":""},null,{"$f":"IF(NOT(ISBLANK(G12)),G12*I12,\"\")","v":""},"","","",{"$f":"IF(NOT(ISBLANK(G12)),SUM(K12:M12),\"\")","v":""},{"$f":"IF(NOT(ISBLANK(I12)),I12*N12,\"\")","v":""},"",{"$f":"IF(P12=\"\",\"\",COUNTIF(P13:$P$2084,P12))","v":""},{"$f":"IF(Q12>0,RIGHT(P12,2),\"\")","v":""}]
[null,null,null,null,null,null,null,{"$f":"IF(ISBLANK(F13),\"\",SUM(G13*60)/F13)","v":""},null,{"$f":"IF(NOT(ISBLANK(G13)),G13*I13,\"\")","v":""},"","","",{"$f":"IF(NOT(ISBLANK(G13)),SUM(K13:M13),\"\")","v":""},{"$f":"IF(NOT(ISBLANK(I13)),I13*N13,\"\")","v":""},"",{"$f":"IF(P13=\"\",\"\",COUNTIF(P14:$P$2084,P13))","v":""},{"$f":"IF(Q13>0,RIGHT(P13,2),\"\")","v":""}]
[null,null,null,null,null,null,null,{"$f":"IF(ISBLANK(F14),\"\",SUM(G14*60)/F14)","v":""},null,{"$f":"IF(NOT(ISBLANK(G14)),G14*I14,\"\")","v":""},"","","",{"$f":"IF(NOT(ISBLANK(G14)),SUM(K14:M14),\"\")","v":""},{"$f":"IF(NOT(ISBLANK(I14)),I14*N14,\"\")","v":""},"",{"$f":"IF(P14=\"\",\"\",COUNTIF(P15:$P$2084,P14))","v":""},{"$f":"IF(Q14>0,RIGHT(P14,2),\"\")","v":""}]
[null,null,null,null,null,null,null,{"$f":"IF(ISBLANK(F15),\"\",SUM(G15*60)/F15)","v":""},null,{"$f":"IF(NOT(ISBLANK(G15)),G15*I15,\"\")","v":""},"","","",{"$f":"IF(NOT(ISBLANK(G15)),SUM(K15:M15),\"\")","v":""},{"$f":"IF(NOT(ISBLANK(I15)),I15*N15,\"\")","v":""},"",{"$f":"IF(P15=\"\",\"\",COUNTIF(P16:$P$2084,P15))","v":""},{"$f":"IF(Q15>0,RIGHT(P15,2),\"\")","v":""}]
[null,null,null,null,null,null,null,{"$f":"IF(ISBLANK(F16),\"\",SUM(G16*60)/F16)","v":""},null,{"$f":"IF(NOT(ISBLANK(G16)),G16*I16,\"\")","v":""},"","","",{"$f":"IF(NOT(ISBLANK(G16)),SUM(K16:M16),\"\")","v":""},{"$f":"IF(NOT(ISBLANK(I16)),I16*N16,\"\")","v":""},"",{"$f":"IF(P16=\"\",\"\",COUNTIF(P17:$P$2084,P16))","v":""},{"$f":"IF(Q16>0,RIGHT(P16,2),\"\")","v":""}]
[null,null,null,null,null,null,null,"",null,"","","","","","","",{"$f":"IF(P17=\"\",\"\",COUNTIF(P18:$P$2084,P17))","v":""},""]
[null,null,null,null,null,null,null,"",null,"","","","","","","",{"$f":"IF(P18=\"\",\"\",COUNTIF(P19:$P$2084,P18))","v":""},""]
[null,null,null,null,null,null,null,"",null,"","","","","","","",{"$f":"IF(P19=\"\",\"\",COUNTIF(P20:$P$2084,P19))","v":""},""]
[null,null,null,null,null,null,null,"",null,"","","","","","","",{"$f":"IF(P20=\"\",\"\",COUNTIF(P21:$P$2084,P20))","v":""},""]
[null,null,null,null,null,null,null,"",null,"","","","","","","",{"$f":"IF(P21=\"\",\"\",COUNTIF(P22:$P$2084,P21))","v":""},""]
[null,null,null,null,null,null,null,"",null,"","","","","","","",{"$f":"IF(P22=\"\",\"\",COUNTIF(P23:$P$2084,P22))","v":""},""]
[null,null,null,null,null,null,null,"",null,"","","","","","","",{"$f":"IF(P23=\"\",\"\",COUNTIF(P24:$P$2084,P23))","v":""},""]
[null,null,null,null,null,null,null,"",null,"","","","","","","",{"$f":"IF(P24=\"\",\"\",COUNTIF(P25:$P$2084,P24))","v":""},""]
[null,null,null,null,null,null,null,"",null,"","","","","","","",{"$f":"IF(P25=\"\",\"\",COUNTIF(P26:$P$2084,P25))","v":""},""]
[null,null,null,null,null,null,null,"",null,"","","","","","","",{"$f":"IF(P26=\"\",\"\",COUNTIF(P27:$P$2084,P26))","v":""},""]
[null,null,null,null,null,null,null,"",null,"","","","","","","",{"$f":"IF(P27=\"\",\"\",COUNTIF(P28:$P$2084,P27))","v":""},""]
[null,null,null,null,null,null,null,"",null,"","","","","","","",{"$f":"IF(P28=\"\",\"\",COUNTIF(P29:$P$2084,P28))","v":""},""]
[null,null,null,null,null,null,null,"",null,"","","","","","","",{"$f":"IF(P29=\"\",\"\",COUNTIF(P30:$P$2084,P29))","v":""},""]
[null,null,null,null,null,null,null,"",null,"","","","","","","",{"$f":"IF(P30=\"\",\"\",COUNTIF(P31:$P$2084,P30))","v":""},""]
[null,null,null,null,null,null,null,"",null,"","","","","","","",{"$f":"IF(P31=\"\",\"\",COUNTIF(P32:$P$2084,P31))","v":""},""]
[null,null,null,null,null,null,null,"",null,"","","","","","","",{"$f":"IF(P32=\"\",\"\",COUNTIF(P33:$P$2084,P32))","v":""},""]
[null,null,null,null,null,null,null,"",null,"","","","","","","",{"$f":"IF(P33=\"\",\"\",COUNTIF(P34:$P$2084,P33))","v":""},""]
[null,null,null,null,null,null,null,"",null,"","","","","","","",{"$f":"IF(P34=\"\",\"\",COUNTIF(P35:$P$2084,P34))","v":""},""]
[null,null,null,null,null,null,null,"",null,"","","","","","","",{"$f":"IF(P35=\"\",\"\",COUNTIF(P36:$P$2084,P35))","v":""},""]
[null,null,null,null,null,null,null,"",null,"","","","","","","",{"$f":"IF(P36=\"\",\"\",COUNTIF(P37:$P$2084,P36))","v":""},""]
[null,null,null,null,null,null,null,"",null,"","","","","","","",{"$f":"IF(P37=\"\",\"\",COUNTIF(P38:$P$2084,P37))","v":""},""]
[null,null,null,null,null,null,null,"",null,"","","","","","","",{"$f":"IF(P38=\"\",\"\",COUNTIF(P39:$P$2084,P38))","v":""},""]
[null,null,null,null,null,null,null,"",null,"","","","","","","",{"$f":"IF(P39=\"\",\"\",COUNTIF(P40:$P$2084,P39))","v":""},""]
[null,null,null,null,null,null,null,"",null,"","","","","","","",{"$f":"IF(P40=\"\",\"\",COUNTIF(P41:$P$2084,P40))","v":""},""]
{"$rows_left_out":594}
{"sheet":"LEAVE RATES","index":3,"n_rows":16,"n_cols":3,"rows_kept":16,"cut":false,"hidden":false,"merged":[]}
[]
[]
["                           VACATION DAYS EARNED EACH YEAR"]
[]
[]
[null,"DAYS PER","12-MONTH"]
["YEARS OF STATE SERVICE","MONTH EARNED","EMPLOYEES"]
["Less than 5 years",1.17,14]
[]
["5 but less than 10 years",1.42,17]
[]
["10 but less than 15 years",1.67,20]
[]
["15 but less than 20 years",1.92,23]
[]
["20 years or more",2.17,26]

{"sheet":"SUMMARY","index":4,"n_rows":57,"n_cols":21,"rows_kept":57,"cut":false,"hidden":false,"merged":[[54,13,54,20],[54,1,54,6],[54,7,54,12],[9,0,9,1],[26,0,26,1],[24,0,24,1],[25,0,25,1],[0,0,0,7],[1,0,1,7],[2,0,2,7],[3,0,3,7],[4,0,4,7]]}
["PUBLIC SCHOOLS OF NORTH CAROLINA"]
["STATE BOARD OF EDUCATION - DEPARTMENT OF PUBLIC INSTRUCTION"]
["OFFICE OF DISTRICT OPERATIONS/TRANSPORTATION SERVICES"]
[" DRIVER SALARY AND ROUTE TIMES REPORT"]
["2023-2024 - SUMMARY AND SIGNATURE PAGE"]
[]
["LEA NAME","(SELECT)"]
["LEA NUMBER",{"$f":"IFERROR(INDEX('DPI Use - LEA Info '!B2:B117,MATCH(B7,'DPI Use - LEA Info '!A2:A117,0),1),\"\")","v":" "}]
[]
["Driver Classification",null,null,"Preparer  Signature:______________________________________________________"]
["Full-time (permanent ) - \"FP\"",{"$f":"SUM('TD-2R-DETAIL'!A2092+'TD-2R-EC'!A619)","v":0},null,"Printed Name:___________________________________________________________"]
["Full-time perm. (split fund) - \"FS\"",{"$f":"SUM('TD-2R-DETAIL'!B2092+'TD-2R-EC'!B619)","v":0},null,"Date:______________________"]
["Full-time (other) - \"FO\"",{"$f":"SUM('TD-2R-DETAIL'!C2092+'TD-2R-EC'!C619)","v":0}]
["Part-time (permanent) - \"PP\"",{"$f":"SUM('TD-2R-DETAIL'!D2092+'TD-2R-EC'!D619)","v":0},null,"Transportation Director Signature:___________________________________________"]
["Part-time perm. (split fund) - \"PS\"",{"$f":"SUM('TD-2R-DETAIL'!E2092+'TD-2R-EC'!E619)","v":0},null,"Printed Name:___________________________________________________________"]
["Part-time (other) - \"PO\"",{"$f":"SUM('TD-2R-DETAIL'!F2092+'TD-2R-EC'!F619)","v":0},null,"Date:______________________"]
["Part-time (temporary) - \"PT",{"$f":"SUM('TD-2R-DETAIL'!G2092+'TD-2R-EC'!G619)","v":0}]
["Student - \"ST\"",{"$f":"SUM('TD-2R-DETAIL'!H2092+'TD-2R-EC'!H619)","v":0},null,"Superintendent Signature:_________________________________________________"]
["Total Drivers (Calculated)",{"$f":"SUM(B11+B12+B13+B14+B15+B16+B17+B18)","v":0},null,"Printed Name:___________________________________________________________"]
[null,null,null,"Date:______________________"]
[]
[]
["CALCULATED FIELDS",null,"NUMBER","ROUTE","DAILY","LEAVE","LEAVE","ROUTE"]
[null,null,"BUSES","HOURS","RATE","HOURS","COMP.","MILEAGE"]
["REGULAR ROUTE BUS TOTALS",null,{"$f":"'TD-2R-DETAIL'!B10","v":0},{"$f":"'TD-2R-DETAIL'!G10","v":0},{"$f":"'TD-2R-DETAIL'!J10","v":0},{"$f":"'TD-2R-DETAIL'!N10","v":0},{"$f":"'TD-2R-DETAIL'!O10","v":0},{"$f":"'TD-2R-DETAIL'!F10","v":0}]
["EC ROUTE BUS TOTALS",null,{"$f":"'TD-2R-EC'!B10","v":0},{"$f":"'TD-2R-EC'!G10","v":0},{"$f":"'TD-2R-EC'!J10","v":0},{"$f":"'TD-2R-EC'!N10","v":0},{"$f":"'TD-2R-EC'!O10","v":0},{"$f":"'TD-2R-EC'!F10","v":0}]
["GRAND TOTALS",null,{"$f":"SUM(C25+C26)","v":0},0,0,0,0,0]
[]
[]
[]
[]
[]
[]
[]
[]
[]
[]
[]
[]
[]
{"$rows_left_out":18}
{"sheet":"DPI Use - LEA Info ","index":5,"n_rows":117,"n_cols":2,"rows_kept":117,"cut":false,"hidden":true,"merged":[]}
["LEA Name","LEA #"]
["(SELECT)"," "]
["ALAMANCE","  010"]
["ALEXANDER","  020"]
["ALLEGHANY","  030"]
["ANSON","  040"]
["ASHE","  050"]
["AVERY","  060"]
["BEAUFORT","  070"]
["BERTIE","  080"]
["BLADEN","  090"]
["BRUNSWICK","  100"]
["BUNCOMBE","  110"]
["ASHEVILLE CITY","  111"]
["BURKE","  120"]
["CABARRUS","  130"]
["KANNAPOLIS CITY","  132"]
["CALDWELL","  140"]
["CAMDEN","  150"]
["CARTERET","  160"]
["CASWELL","  170"]
["CATAWBA","  180"]
["HICKORY CITY","  181"]
["NEWTON-CONOVER CITY","  182"]
["CHATHAM","  190"]
["CHEROKEE","  200"]
["CHOWAN","  210"]
["CLAY","  220"]
["CLEVELAND","  230"]
["COLUMBUS","  240"]
["WHITEVILLE CITY","  241"]
["CRAVEN","  250"]
["CUMBERLAND","  260"]
["CURRITUCK","  270"]
["DARE","  280"]
["DAVIDSON","  290"]
["LEXINGTON CITY","  291"]
["THOMASVILLE CITY","  292"]
["DAVIE","  300"]
["DUPLIN","  310"]
{"$rows_left_out":77}